Reaction Details
TargetCarbonic anhydrase 2
LigandBDBM50066124
Substrate/Competitorn/a
Meas. Tech.ChEMBL_1465100 (CHEMBL3405432)
Ki 42±n/a nM
Citation Carta, FDi Cesare Mannelli, LPinard, MGhelardini, CScozzafava, AMcKenna, RSupuran, CT A class of sulfonamide carbonic anhydrase inhibitors with neuropathic pain modulating effects. Bioorg Med Chem23:1828-40 (2015) 
 
Carbonic anhydrase 2
Name:Carbonic anhydrase 2
Type:Enzyme
Mol. Mass.:29250.71
Organism:Homo sapiens (Human)
Description:P00918
Residue:260
BDBM50066124
NameBDBM50066124
Synonyms:CHEMBL3402968
TypeSmall organic molecule
Emp. Form.C15H13NO3S
Mol. Mass.287.334
SMILESNS(=O)(=O)c1ccc(OCC#Cc2ccccc2)cc1