Reaction Details
TargetCarbonic anhydrase 2
LigandBDBM50066120
Substrate/Competitorn/a
Meas. Tech.ChEMBL_1465100 (CHEMBL3405432)
Ki 52±n/a nM
Citation Carta, FDi Cesare Mannelli, LPinard, MGhelardini, CScozzafava, AMcKenna, RSupuran, CT A class of sulfonamide carbonic anhydrase inhibitors with neuropathic pain modulating effects. Bioorg Med Chem23:1828-40 (2015) 
 
Carbonic anhydrase 2
Name:Carbonic anhydrase 2
Type:Enzyme
Mol. Mass.:29250.71
Organism:Homo sapiens (Human)
Description:P00918
Residue:260
BDBM50066120
NameBDBM50066120
Synonyms:CHEMBL3402972
TypeSmall organic molecule
Emp. Form.C16H12N2O3S2
Mol. Mass.344.408
SMILESNS(=O)(=O)c1nc2ccc(OCC#Cc3ccccc3)cc2s1