Reaction Details
TargetCarbonic anhydrase 7
LigandBDBM50066122
Substrate/Competitorn/a
Meas. Tech.ChEMBL_1465101 (CHEMBL3405433)
Ki 86±n/a nM
Citation Carta, FDi Cesare Mannelli, LPinard, MGhelardini, CScozzafava, AMcKenna, RSupuran, CT A class of sulfonamide carbonic anhydrase inhibitors with neuropathic pain modulating effects. Bioorg Med Chem23:1828-40 (2015) 
 
Carbonic anhydrase 7
Name:Carbonic anhydrase 7
Type:Enzyme
Mol. Mass.:29664.11
Organism:Homo sapiens (Human)
Description:Human cloned isozyme.
Residue:264
BDBM50066122
NameBDBM50066122
Synonyms:CHEMBL3402970
TypeSmall organic molecule
Emp. Form.C12H18N2O4S
Mol. Mass.286.347
SMILESNS(=O)(=O)c1ccc(OCCN2CCOCC2)cc1