Reaction Details
TargetCarbonic anhydrase 7
LigandBDBM50066118
Substrate/Competitorn/a
Meas. Tech.ChEMBL_1465101 (CHEMBL3405433)
Ki 8.6±n/a nM
Citation Carta, FDi Cesare Mannelli, LPinard, MGhelardini, CScozzafava, AMcKenna, RSupuran, CT A class of sulfonamide carbonic anhydrase inhibitors with neuropathic pain modulating effects. Bioorg Med Chem23:1828-40 (2015) 
 
Carbonic anhydrase 7
Name:Carbonic anhydrase 7
Type:Enzyme
Mol. Mass.:29664.11
Organism:Homo sapiens (Human)
Description:Human cloned isozyme.
Residue:264
BDBM50066118
NameBDBM50066118
Synonyms:CHEMBL3402973
TypeSmall organic molecule
Emp. Form.C12H12N2O2S
Mol. Mass.248.301
SMILESNS(=O)(=O)c1ccc(cc1)N(CC#C)CC#C