Reaction Details
TargetCarbonic anhydrase 12
LigandBDBM50066132
Substrate/Competitorn/a
Meas. Tech.ChEMBL_1465103 (CHEMBL3405435)
Ki 6.8±n/a nM
Citation Carta, FDi Cesare Mannelli, LPinard, MGhelardini, CScozzafava, AMcKenna, RSupuran, CT A class of sulfonamide carbonic anhydrase inhibitors with neuropathic pain modulating effects. Bioorg Med Chem23:1828-40 (2015) 
 
Carbonic anhydrase 12
Name:Carbonic anhydrase 12
Type:Enzyme
Mol. Mass.:39456.00
Organism:Homo sapiens (Human)
Description:Catalytic domain of human cloned isozyme was used in the assay
Residue:354
BDBM50066132
NameBDBM50066132
Synonyms:CHEMBL3402960
TypeSmall organic molecule
Emp. Form.C9H11NO3S
Mol. Mass.213.254
SMILESNS(=O)(=O)c1ccc(OCC=C)cc1