Reaction Details
TargetCarbonic anhydrase 12
LigandBDBM50066129
Substrate/Competitorn/a
Meas. Tech.ChEMBL_1465103 (CHEMBL3405435)
Ki 8.0±n/a nM
Citation Carta, FDi Cesare Mannelli, LPinard, MGhelardini, CScozzafava, AMcKenna, RSupuran, CT A class of sulfonamide carbonic anhydrase inhibitors with neuropathic pain modulating effects. Bioorg Med Chem23:1828-40 (2015) 
 
Carbonic anhydrase 12
Name:Carbonic anhydrase 12
Type:Enzyme
Mol. Mass.:39456.00
Organism:Homo sapiens (Human)
Description:Catalytic domain of human cloned isozyme was used in the assay
Residue:354
BDBM50066129
NameBDBM50066129
Synonyms:CHEMBL3402963
TypeSmall organic molecule
Emp. Form.C13H12FNO3S
Mol. Mass.281.303
SMILESNS(=O)(=O)c1ccc(OCc2ccc(F)cc2)cc1