Reaction Details
TargetDual specificity mitogen-activated protein kinase kinase 1
LigandBDBM50066137
Substrate/Competitorn/a
Meas. Tech.ChEMBL_1465213 (CHEMBL3406097)
IC50 27±n/a nM
Citation Van Dort, MEGalbán, SWang, HSebolt-Leopold, JWhitehead, CHong, HRehemtulla, ARoss, BD Dual inhibition of allosteric mitogen-activated protein kinase (MEK) and phosphatidylinositol 3-kinase (PI3K) oncogenic targets with a bifunctional inhibitor. Bioorg Med Chem23:1386-94 (2015) 
 
Dual specificity mitogen-activated protein kinase kinase 1
Name:Dual specificity mitogen-activated protein kinase kinase 1
Type:Other Protein Type
Mol. Mass.:43439.03
Organism:Homo sapiens (Human)
Description:Full-length human MEK-1 was generated by PCR and purified as a fusion protein from Escherichia coli lysates.
Residue:393
BDBM50066137
NameBDBM50066137
Synonyms:CHEMBL3400287
TypeSmall organic molecule
Emp. Form.C23H24N2O6S
Mol. Mass.456.511
SMILESCN(C)C(=O)Oc1ccc2c(C)c(Cc3cccc(c3)N3CCCS3(=O)=O)c(=O)oc2c1