Reaction Details
TargetRenin
LigandBDBM50066150
Substrate/Competitorn/a
Meas. Tech.ChEMBL_1465587 (CHEMBL3404889)
IC50 8.0±n/a nM
Citation Lorthiois, ECumin, FEhrhardt, CKosaka, TSellner, HOstermann, NFrancotte, EWagner, TMaibaum, J trans-(3S,4S)-Disubstituted pyrrolidines as inhibitors of the human aspartyl protease renin. Part I: prime site exploration using an amino linker. Bioorg Med Chem Lett25:1782-6 (2015) 
 
Renin
Name:Renin
Type:Enzyme
Mol. Mass.:45058.99
Organism:Homo sapiens (Human)
Description:n/a
Residue:406
BDBM50066150
NameBDBM50066150
Synonyms:CHEMBL3401537
TypeSmall organic molecule
Emp. Form.C32H41N3O7S
Mol. Mass.611.749
SMILESCOCCCOc1cc(ccc1OC)C(=O)N(C[C@@H]1CNC[C@H]1NS(=O)(=O)c1ccc(Oc2ccccc2)cc1)C(C)C