Reaction Details
TargetRenin
LigandBDBM50066157
Substrate/Competitorn/a
Meas. Tech.ChEMBL_1465587 (CHEMBL3404889)
IC50 25±n/a nM
Citation Lorthiois, ECumin, FEhrhardt, CKosaka, TSellner, HOstermann, NFrancotte, EWagner, TMaibaum, J trans-(3S,4S)-Disubstituted pyrrolidines as inhibitors of the human aspartyl protease renin. Part I: prime site exploration using an amino linker. Bioorg Med Chem Lett25:1782-6 (2015) 
 
Renin
Name:Renin
Type:Enzyme
Mol. Mass.:45058.99
Organism:Homo sapiens (Human)
Description:n/a
Residue:406
BDBM50066157
NameBDBM50066157
Synonyms:CHEMBL3400456
TypeSmall organic molecule
Emp. Form.C23H39N3O6S
Mol. Mass.485.637
SMILESCCCS(=O)(=O)N[C@@H]1CNC[C@H]1CN(C(C)C)C(=O)c1ccc(OC)c(OCCCOC)c1