Reaction Details
TargetMu-type opioid receptor
LigandBDBM50066351
Substrate/Competitorn/a
Meas. Tech.ChEMBL_1465623 (CHEMBL3405071)
Ki 3.6±n/a nM
Citation Yuan, YZaidi, SAStevens, DLScoggins, KLMosier, PDKellogg, GEDewey, WLSelley, DEZhang, Y Design, syntheses, and pharmacological characterization of 17-cyclopropylmethyl-3,14ß-dihydroxy-4,5a-epoxy-6a-(isoquinoline-3'-carboxamido)morphinan analogues as opioid receptor ligands. Bioorg Med Chem23:1701-15 (2015) 
 
Mu-type opioid receptor
Name:Mu-type opioid receptor
Type:Enzyme Catalytic Domain
Mol. Mass.:44431.62
Organism:MOUSE
Description:OPIATE Mu OPRM1 MOUSE::P42866
Residue:398
BDBM50066351
NameBDBM50066351
Synonyms:CHEMBL3401555
TypeSmall organic molecule
Emp. Form.C30H30N4O6
Mol. Mass.542.5824
SMILES[H][C@@]12Oc3c4c(C[C@@]5([H])N(CC6CC6)CC[C@@]14[C@@]5(O)CC[C@@H]2NC(=O)c1cc2ccc(cc2cn1)[N+]([O-])=O)ccc3O