Reaction Details
TargetKappa-type opioid receptor
LigandBDBM50066277
Substrate/Competitorn/a
Meas. Tech.ChEMBL_1465624 (CHEMBL3405072)
Ki 1.6±n/a nM
Citation Yuan, YZaidi, SAStevens, DLScoggins, KLMosier, PDKellogg, GEDewey, WLSelley, DEZhang, Y Design, syntheses, and pharmacological characterization of 17-cyclopropylmethyl-3,14ß-dihydroxy-4,5a-epoxy-6a-(isoquinoline-3'-carboxamido)morphinan analogues as opioid receptor ligands. Bioorg Med Chem23:1701-15 (2015) 
 
Kappa-type opioid receptor
Name:Kappa-type opioid receptor
Type:Enzyme
Mol. Mass.:42656.78
Organism:Mus musculus (Mouse)
Description:P33534
Residue:380
BDBM50066277
NameBDBM50066277
Synonyms:CHEMBL2419119
TypeSmall organic molecule
Emp. Form.C32H35N3O4
Mol. Mass.525.638
SMILES[H][C@@]12Oc3c4c(C[C@@]5([H])N(CC6CC6)CC[C@@]14[C@@]5(O)CC[C@@H]2NC(=O)CCc1cc2ccccc2cn1)ccc3O