Reaction Details
TargetDelta-type opioid receptor
LigandBDBM50066346
Substrate/Competitorn/a
Meas. Tech.ChEMBL_1465625 (CHEMBL3405073)
Ki 118±n/a nM
Citation Yuan, YZaidi, SAStevens, DLScoggins, KLMosier, PDKellogg, GEDewey, WLSelley, DEZhang, Y Design, syntheses, and pharmacological characterization of 17-cyclopropylmethyl-3,14ß-dihydroxy-4,5a-epoxy-6a-(isoquinoline-3'-carboxamido)morphinan analogues as opioid receptor ligands. Bioorg Med Chem23:1701-15 (2015) 
 
Delta-type opioid receptor
Name:Delta-type opioid receptor
Type:Enzyme Catalytic Domain
Mol. Mass.:40577.25
Organism:MOUSE
Description:P32300
Residue:372
BDBM50066346
NameBDBM50066346
Synonyms:CHEMBL2419125
TypeSmall organic molecule
Emp. Form.C31H33N3O4
Mol. Mass.511.6114
SMILES[H][C@@]12Oc3c4c(C[C@@]5([H])N(CC6CC6)CC[C@@]14[C@@]5(O)CC[C@@H]2NC(=O)c1cc2ccccc2c(C)n1)ccc3O