Reaction Details
TargetDelta-type opioid receptor
LigandBDBM50292919
Substrate/Competitorn/a
Meas. Tech.ChEMBL_1465639 (CHEMBL3405087)
EC50 99±n/a nM
Citation Yuan, YZaidi, SAStevens, DLScoggins, KLMosier, PDKellogg, GEDewey, WLSelley, DEZhang, Y Design, syntheses, and pharmacological characterization of 17-cyclopropylmethyl-3,14ß-dihydroxy-4,5a-epoxy-6a-(isoquinoline-3'-carboxamido)morphinan analogues as opioid receptor ligands. Bioorg Med Chem23:1701-15 (2015) 
 
Delta-type opioid receptor
Name:Delta-type opioid receptor
Type:Enzyme Catalytic Domain
Mol. Mass.:40577.25
Organism:MOUSE
Description:P32300
Residue:372
BDBM50292919
NameBDBM50292919
Synonyms:17-Cyclopropylmethyl-3,14beta-dihydroxy-4,5r-epoxy-6alpha-[(3'-isoquinolyl)acetamido]morphinan | CHEMBL522201
TypeSmall organic molecule
Emp. Form.C30H31N3O4
Mol. Mass.497.5848
SMILESOc1ccc2C[C@H]3N(CC4CC4)CC[C@@]45[C@@H](Oc1c24)[C@H](CC[C@@]35O)NC(=O)c1cc2ccccc2cn1