Reaction Details
TargetDelta-type opioid receptor
LigandBDBM50066348
Substrate/Competitorn/a
Meas. Tech.ChEMBL_1465639 (CHEMBL3405087)
EC50 108±n/a nM
Citation Yuan, YZaidi, SAStevens, DLScoggins, KLMosier, PDKellogg, GEDewey, WLSelley, DEZhang, Y Design, syntheses, and pharmacological characterization of 17-cyclopropylmethyl-3,14ß-dihydroxy-4,5a-epoxy-6a-(isoquinoline-3'-carboxamido)morphinan analogues as opioid receptor ligands. Bioorg Med Chem23:1701-15 (2015) 
 
Delta-type opioid receptor
Name:Delta-type opioid receptor
Type:Enzyme Catalytic Domain
Mol. Mass.:40577.25
Organism:MOUSE
Description:P32300
Residue:372
BDBM50066348
NameBDBM50066348
Synonyms:CHEMBL3401554
TypeSmall organic molecule
Emp. Form.C30H30N4O6
Mol. Mass.542.5824
SMILES[H][C@@]12Oc3c4c(C[C@@]5([H])N(CC6CC6)CC[C@@]14[C@@]5(O)CC[C@@H]2NC(=O)c1cc2cc(ccc2cn1)[N+]([O-])=O)ccc3O