Reaction Details
TargetBcl-2-like protein 1
LigandBDBM50030764
Substrate/Competitorn/a
Meas. Tech.ChEMBL_1465965 (CHEMBL3406793)
IC50 3.0±n/a nM
Citation Levoin, NVo, DDGautier, FBarillé-Nion, SJuin, PTasseau, OGrée, R A combination of in silico and SAR studies to identify binding hot spots of Bcl-xL inhibitors. Bioorg Med Chem23:1747-57 (2015) 
 
Bcl-2-like protein 1
Name:Bcl-2-like protein 1
Type:Mitochondrion membrane; Single-pass membrane protein
Mol. Mass.:26039.60
Organism:Homo sapiens (Human)
Description:n/a
Residue:233
BDBM50030764
NameBDBM50030764
Synonyms:CHEMBL3342187
TypeSmall organic molecule
Emp. Form.C31H29N5O3S2
Mol. Mass.583.724
SMILESNCc1ccc(OCCCc2sc(nc2C(O)=O)-c2ccc3CCC\C(=N/Nc4nc5ccccc5s4)c3c2)cc1