Reaction Details
TargetBcl-2-like protein 1
LigandBDBM21447
Substrate/Competitorn/a
Meas. Tech.ChEMBL_1465965 (CHEMBL3406793)
IC50 6.0±n/a nM
Citation Levoin, NVo, DDGautier, FBarillé-Nion, SJuin, PTasseau, OGrée, R A combination of in silico and SAR studies to identify binding hot spots of Bcl-xL inhibitors. Bioorg Med Chem23:1747-57 (2015) 
 
Bcl-2-like protein 1
Name:Bcl-2-like protein 1
Type:Mitochondrion membrane; Single-pass membrane protein
Mol. Mass.:26039.60
Organism:Homo sapiens (Human)
Description:n/a
Residue:233
BDBM21447
NameBDBM21447
Synonyms:4-(4-{[2-(4-chlorophenyl)phenyl]methyl}piperazin-1-yl)-N-[(4-{[(2R)-4-(dimethylamino)-1-(phenylsulfanyl)butan-2-yl]amino}-3-nitrobenzene)sulfonyl]benzamide CHEMBL376408 US11760752, Compound ABT-737 | US9125913, ABT-737
TypeSmall organic molecule
Emp. Form.C42H45ClN6O5S2
Mol. Mass.813.427
SMILESCN(C)CC[C@H](CSc1ccccc1)Nc1ccc(cc1[N+]([O-])=O)S(=O)(=O)NC(=O)c1ccc(cc1)N1CCN(Cc2ccccc2-c2ccc(Cl)cc2)CC1