Reaction Details
TargetBcl-2-like protein 1
LigandBDBM23223
Substrate/Competitorn/a
Meas. Tech.ChEMBL_1465965 (CHEMBL3406793)
Ki 1000±n/a nM
Citation Levoin, NVo, DDGautier, FBarillé-Nion, SJuin, PTasseau, OGrée, R A combination of in silico and SAR studies to identify binding hot spots of Bcl-xL inhibitors. Bioorg Med Chem23:1747-57 (2015) 
 
Bcl-2-like protein 1
Name:Bcl-2-like protein 1
Type:Mitochondrion membrane; Single-pass membrane protein
Mol. Mass.:26039.60
Organism:Homo sapiens (Human)
Description:n/a
Residue:233
BDBM23223
NameBDBM23223
Synonyms:7-[8-formyl-1,6,7-trihydroxy-3-methyl-5-(propan-2-yl)naphthalen-2-yl]-2,3,8-trihydroxy-6-methyl-4-(propan-2-yl)naphthalene-1-carbaldehyde Gossypol Gossypol, 4 Tash 1 cid_3503
TypeSmall organic molecule
Emp. Form.C30H30O8
Mol. Mass.518.5544
SMILESCC(C)c1c(O)c(O)c(C=O)c2c(O)c(c(C)cc12)-c1c(C)cc2c(C(C)C)c(O)c(O)c(C=O)c2c1O