Reaction Details
TargetCannabinoid receptor 1
LigandBDBM50066795
Substrate/Competitorn/a
Meas. Tech.ChEMBL_1465984 (CHEMBL3406966)
IC50 3620±n/a nM
Citation Nguyen, TGerman, NDecker, AMLi, JXWiley, JLThomas, BFKenakin, TPZhang, Y Structure-activity relationships of substituted 1H-indole-2-carboxamides as CB1 receptor allosteric modulators. Bioorg Med Chem23:2195-203 (2015) 
 
Cannabinoid receptor 1
Name:Cannabinoid receptor 1
Type:G Protein-Coupled Receptor (GPCR)
Mol. Mass.:52868.96
Organism:Homo sapiens (Human)
Description:P21554
Residue:472
BDBM50066795
NameBDBM50066795
Synonyms:CHEMBL3400535
TypeSmall organic molecule
Emp. Form.C25H32ClN3O
Mol. Mass.425.994
SMILESCCCCCCNc1ccc(CCNC(=O)c2[nH]c3ccc(Cl)cc3c2CC)cc1