Reaction Details
TargetCannabinoid receptor 1
LigandBDBM50066803
Substrate/Competitorn/a
Meas. Tech.ChEMBL_1465984 (CHEMBL3406966)
IC50 5810±n/a nM
Citation Nguyen, TGerman, NDecker, AMLi, JXWiley, JLThomas, BFKenakin, TPZhang, Y Structure-activity relationships of substituted 1H-indole-2-carboxamides as CB1 receptor allosteric modulators. Bioorg Med Chem23:2195-203 (2015) 
 
Cannabinoid receptor 1
Name:Cannabinoid receptor 1
Type:G Protein-Coupled Receptor (GPCR)
Mol. Mass.:52868.96
Organism:Homo sapiens (Human)
Description:P21554
Residue:472
BDBM50066803
NameBDBM50066803
Synonyms:CHEMBL3401602
TypeSmall organic molecule
Emp. Form.C19H18Cl2N2O
Mol. Mass.361.265
SMILESCCc1c([nH]c2ccc(Cl)cc12)C(=O)NCCc1ccccc1Cl