Reaction Details
TargetBifunctional epoxide hydrolase 2
LigandBDBM50066840
Substrate/Competitorn/a
Meas. Tech.ChEMBL_1465994 (CHEMBL3406976)
IC50 0.700000±n/a nM
Citation Takai, KChiyo, NNakajima, TNariai, TIshikawa, CNakatani, SIkeno, AYamamoto, SSone, T Three-dimensional rational approach to the discovery of potent substituted cyclopropyl urea soluble epoxide hydrolase inhibitors. Bioorg Med Chem Lett25:1705-8 (2015) 
 
Bifunctional epoxide hydrolase 2
Name:Bifunctional epoxide hydrolase 2
Type:Enzyme
Mol. Mass.:62613.07
Organism:Homo sapiens (Human)
Description:P34913
Residue:555
BDBM50066840
NameBDBM50066840
Synonyms:CHEMBL3401639
TypeSmall organic molecule
Emp. Form.C27H28FN3O3S
Mol. Mass.493.593
SMILESFc1ccc(cc1)S(=O)(=O)N[C@@H]1CCCN(C1)C(=O)N[C@H]1[C@@H]([C@@H]1c1ccccc1)c1ccccc1