Reaction Details
TargetCysteinyl leukotriene receptor 2
LigandBDBM50066952
Substrate/Competitorn/a
Meas. Tech.ChEMBL_1466141 (CHEMBL3404759)
IC50 25±n/a nM
Citation Itadani, STakahashi, SIma, MSekiguchi, TAratani, YEgashira, HMatsumura, NInoue, AYonetomi, YFujita, MNakayama, YTakeuchi, J Discovery of a potent, orally available dual CysLT1 and CysLT2 antagonist with dicarboxylic acid. Bioorg Med Chem23:2079-97 (2015) 
 
Cysteinyl leukotriene receptor 2
Name:Cysteinyl leukotriene receptor 2
Type:Enzyme Catalytic Domain
Mol. Mass.:39657.52
Organism:Homo sapiens (Human)
Description:Leukotriene Cysteinyl 2 CYSLTR2 HUMAN::Q9NS75
Residue:346
BDBM50066952
NameBDBM50066952
Synonyms:CHEMBL3403190
TypeSmall organic molecule
Emp. Form.C32H33NO6
Mol. Mass.527.6075
SMILESOC(=O)CCCn1cc(CC(O)=O)c2c(\C=C\c3ccc(OCCCCOc4ccccc4)cc3)cccc12