Reaction Details
Target15-hydroxyprostaglandin dehydrogenase [NAD(+)]
LigandBDBM50066953
Substrate/Competitorn/a
Meas. Tech.ChEMBL_1466178 (CHEMBL3404953)
IC50 4.0±n/a nM
Citation Piao, YLRam Song, ACho, H Cell-based biological evaluations of 5-(3-bromo-4-phenethoxybenzylidene)thiazolidine-2,4-dione as promising wound healing agent. Bioorg Med Chem23:2098-103 (2015) 
 
15-hydroxyprostaglandin dehydrogenase [NAD(+)]
Name:15-hydroxyprostaglandin dehydrogenase [NAD(+)]
Type:Enzyme
Mol. Mass.:28974.46
Organism:Homo sapiens (Human)
Description:P15428
Residue:266
BDBM50066953
NameBDBM50066953
Synonyms:CHEMBL3403240
TypeSmall organic molecule
Emp. Form.C18H14BrNO3S
Mol. Mass.404.278
SMILESBrc1cc(\C=C2/SC(=O)NC2=O)ccc1OCCc1ccccc1