Reaction Details
TargetDual specificity calcium/calmodulin-dependent 3',5'-cyclic nucleotide phosphodiesterase 1A
LigandBDBM50067186
Substrate/Competitorn/a
Meas. Tech.ChEMBL_1463978 (CHEMBL3405812)
IC50 62±n/a nM
Citation Sawant, SDLakshma Reddy, GDar, MISrinivas, MGupta, GSahu, PKMahajan, PNargotra, ASingh, SSharma, SCTikoo, MSingh, GVishwakarma, RASyed, SH Discovery of novel pyrazolopyrimidinone analogs as potent inhibitors of phosphodiesterase type-5. Bioorg Med Chem23:2121-8 (2015) 
 
Dual specificity calcium/calmodulin-dependent 3',5'-cyclic nucleotide phosphodiesterase 1A
Name:Dual specificity calcium/calmodulin-dependent 3',5'-cyclic nucleotide phosphodiesterase 1A
Type:Protein
Mol. Mass.:61245.69
Organism:Homo sapiens (Human)
Description:P54750
Residue:535
BDBM50067186
NameBDBM50067186
Synonyms:CHEMBL3401745
TypeSmall organic molecule
Emp. Form.C23H33N5O5S
Mol. Mass.491.604
SMILESCCCc1nn(C)c2c1nc([nH]c2=O)-c1cc(ccc1OCC)S(=O)(=O)NCCCCCCO