Reaction Details
TargetcGMP-specific 3',5'-cyclic phosphodiesterase
LigandBDBM50067195
Substrate/Competitorn/a
Meas. Tech.ChEMBL_1463977 (CHEMBL3405811)
IC50 1.6±n/a nM
Citation Sawant, SDLakshma Reddy, GDar, MISrinivas, MGupta, GSahu, PKMahajan, PNargotra, ASingh, SSharma, SCTikoo, MSingh, GVishwakarma, RASyed, SH Discovery of novel pyrazolopyrimidinone analogs as potent inhibitors of phosphodiesterase type-5. Bioorg Med Chem23:2121-8 (2015) 
 
cGMP-specific 3',5'-cyclic phosphodiesterase
Name:cGMP-specific 3',5'-cyclic phosphodiesterase
Type:Protein
Mol. Mass.:99975.83
Organism:Homo sapiens (Human)
Description:O76074
Residue:875
BDBM50067195
NameBDBM50067195
Synonyms:CHEMBL3401754
TypeSmall organic molecule
Emp. Form.C23H32N6O5S
Mol. Mass.504.602
SMILESCCCc1nn(C)c2c1nc([nH]c2=O)-c1cc(ccc1OCC)S(=O)(=O)NCCN1CCOCC1