Reaction Details
TargetHigh affinity choline transporter 1
LigandBDBM50067203
Substrate/Competitorn/a
Meas. Tech.ChEMBL_1464246 (CHEMBL3404113)
IC50 1580±n/a nM
Citation Bollinger, SREngers, DWEnnis, EAWright, JLocuson, CWLindsley, CWBlakely, RDHopkins, CR Synthesis and structure-activity relationships of a series of 4-methoxy-3-(piperidin-4-yl)oxy benzamides as novel inhibitors of the presynaptic choline transporter. Bioorg Med Chem Lett25:1757-60 (2015) 
 
High affinity choline transporter 1
Name:High affinity choline transporter 1
Type:PROTEIN
Mol. Mass.:63194.33
Organism:Homo sapiens (Human)
Description:ChEMBL_1464247
Residue:580
BDBM50067203
NameBDBM50067203
Synonyms:CHEMBL3182315
TypeSmall organic molecule
Emp. Form.C24H36N4O3
Mol. Mass.428.5676
SMILESCCn1nc(C)c(CNC(=O)c2ccc(OC)c(OC3CCN(CC3)C(C)C)c2)c1C