Reaction Details
TargetHigh affinity choline transporter 1
LigandBDBM50067207
Substrate/Competitorn/a
Meas. Tech.ChEMBL_1464246 (CHEMBL3404113)
IC50 270±n/a nM
Citation Bollinger, SREngers, DWEnnis, EAWright, JLocuson, CWLindsley, CWBlakely, RDHopkins, CR Synthesis and structure-activity relationships of a series of 4-methoxy-3-(piperidin-4-yl)oxy benzamides as novel inhibitors of the presynaptic choline transporter. Bioorg Med Chem Lett25:1757-60 (2015) 
 
High affinity choline transporter 1
Name:High affinity choline transporter 1
Type:PROTEIN
Mol. Mass.:63194.33
Organism:Homo sapiens (Human)
Description:ChEMBL_1464247
Residue:580
BDBM50067207
NameBDBM50067207
Synonyms:CHEMBL3304438
TypeSmall organic molecule
Emp. Form.C21H29N3O4
Mol. Mass.387.4727
SMILESCOc1ccc(cc1OC1CCN(C)CC1)C(=O)NCc1cc(no1)C(C)C