Reaction Details
TargetHigh affinity choline transporter 1
LigandBDBM50067199
Substrate/Competitorn/a
Meas. Tech.ChEMBL_1464247 (CHEMBL3404114)
IC50 1020±n/a nM
Citation Bollinger, SREngers, DWEnnis, EAWright, JLocuson, CWLindsley, CWBlakely, RDHopkins, CR Synthesis and structure-activity relationships of a series of 4-methoxy-3-(piperidin-4-yl)oxy benzamides as novel inhibitors of the presynaptic choline transporter. Bioorg Med Chem Lett25:1757-60 (2015) 
 
High affinity choline transporter 1
Name:High affinity choline transporter 1
Type:PROTEIN
Mol. Mass.:63194.33
Organism:Homo sapiens (Human)
Description:ChEMBL_1464247
Residue:580
BDBM50067199
NameBDBM50067199
Synonyms:CHEMBL3187862
TypeSmall organic molecule
Emp. Form.C21H29N3O3S
Mol. Mass.403.538
SMILESCOc1ccc(cc1OC1CCN(CC1)C(C)C)C(=O)NCc1nc(C)cs1