Reaction Details
TargetHigh affinity choline transporter 1
LigandBDBM50067209
Substrate/Competitorn/a
Meas. Tech.ChEMBL_1464247 (CHEMBL3404114)
IC50 530±n/a nM
Citation Bollinger, SREngers, DWEnnis, EAWright, JLocuson, CWLindsley, CWBlakely, RDHopkins, CR Synthesis and structure-activity relationships of a series of 4-methoxy-3-(piperidin-4-yl)oxy benzamides as novel inhibitors of the presynaptic choline transporter. Bioorg Med Chem Lett25:1757-60 (2015) 
 
High affinity choline transporter 1
Name:High affinity choline transporter 1
Type:PROTEIN
Mol. Mass.:63194.33
Organism:Homo sapiens (Human)
Description:ChEMBL_1464247
Residue:580
BDBM50067209
NameBDBM50067209
Synonyms:CHEMBL3303792
TypeSmall organic molecule
Emp. Form.C22H31N3O4
Mol. Mass.401.4992
SMILESCOc1ccc(cc1OCCN1CCCCC1)C(=O)NCc1cc(no1)C(C)C