Reaction Details
TargetNAD-dependent protein deacylase sirtuin-5, mitochondrial
LigandBDBM50336799
Substrate/Competitorn/a
Meas. Tech.ChEMBL_1465151 (CHEMBL3405664)
IC50 2000±n/a nM
Citation Li, YHuang, WYou, LXie, THe, B A FRET-based assay for screening SIRT5 specific modulators. Bioorg Med Chem Lett25:1671-4 (2015) 
 
NAD-dependent protein deacylase sirtuin-5, mitochondrial
Name:NAD-dependent protein deacylase sirtuin-5, mitochondrial
Type:Protein
Mol. Mass.:33892.62
Organism:Homo sapiens (Human)
Description:Q9NXA8
Residue:310
BDBM50336799
NameBDBM50336799
Synonyms:5,5',5''-[1,3,6-naphthalenetriyltris(sulfonylimino)]tris[1,3-benzenesulfonate analogue 8,8'-[CARBONYLBIS[IMINO-3,1-PHENYLENECARBONYLIMINO(4-METHYL-3,1-PHENYLENE)CARBONYLIMINO]]BIS-1,3,5-NAPHTHALENETRISULFONIC ACID 8-[(4-methyl-3-{[3-({[3-({2-methyl-5-[(4,6,8-trisulfonaphthalen-1-yl)carbamoyl]phenyl}carbamoyl)phenyl]carbamoyl}amino)benzene]amido}benzene)amido]naphthalene-1,3,5-trisulfonic acid Germanin US8835659, Suramin suramin
TypeSmall organic molecule
Emp. Form.C51H40N6O23S6
Mol. Mass.1297.28
SMILESCc1ccc(cc1NC(=O)c1cccc(NC(=O)Nc2cccc(c2)C(=O)Nc2cc(ccc2C)C(=O)Nc2ccc(c3cc(cc(c23)S(O)(=O)=O)S(O)(=O)=O)S(O)(=O)=O)c1)C(=O)Nc1ccc(c2cc(cc(c12)S(O)(=O)=O)S(O)(=O)=O)S(O)(=O)=O