Reaction Details
TargetBcl-2-like protein 1
LigandBDBM50067355
Substrate/Competitorn/a
Meas. Tech.ChEMBL_1465156 (CHEMBL3405857)
Ki 80±n/a nM
Citation Wan, YWu, SXiao, GLiu, THou, XChen, CGuan, PYang, XFang, H Design, synthesis and preliminary bioactivity studies of 2-thioxo-4-thiazolidinone derivatives as Bcl-2 inhibitors. Bioorg Med Chem23:1994-2003 (2015) 
 
Bcl-2-like protein 1
Name:Bcl-2-like protein 1
Type:Mitochondrion membrane; Single-pass membrane protein
Mol. Mass.:26039.60
Organism:Homo sapiens (Human)
Description:n/a
Residue:233
BDBM50067355
NameBDBM50067355
Synonyms:CHEMBL3401825
TypeSmall organic molecule
Emp. Form.C33H23N5O8S3
Mol. Mass.713.759
SMILES[O-][N+](=O)c1ccc(cc1)-c1ccc(\C=C2/SC(=S)N([C@@H](Cc3c[nH]c4ccccc34)C(=O)NS(=O)(=O)c3ccc(cc3)[N+]([O-])=O)C2=O)cc1