Reaction Details
TargetBcl-2-like protein 1
LigandBDBM50067458
Substrate/Competitorn/a
Meas. Tech.ChEMBL_1465156 (CHEMBL3405857)
Ki 470±n/a nM
Citation Wan, YWu, SXiao, GLiu, THou, XChen, CGuan, PYang, XFang, H Design, synthesis and preliminary bioactivity studies of 2-thioxo-4-thiazolidinone derivatives as Bcl-2 inhibitors. Bioorg Med Chem23:1994-2003 (2015) 
 
Bcl-2-like protein 1
Name:Bcl-2-like protein 1
Type:Mitochondrion membrane; Single-pass membrane protein
Mol. Mass.:26039.60
Organism:Homo sapiens (Human)
Description:n/a
Residue:233
BDBM50067458
NameBDBM50067458
Synonyms:CHEMBL3401801
TypeSmall organic molecule
Emp. Form.C31H22BrClN2O4S3
Mol. Mass.698.069
SMILESClc1ccc(cc1)-c1ccc(\C=C2/SC(=S)N([C@@H](Cc3ccc(Br)cc3)C(=O)NS(=O)(=O)c3ccccc3)C2=O)cc1