Reaction Details
TargetApoptosis regulator Bcl-2
LigandBDBM50067364
Substrate/Competitorn/a
Meas. Tech.ChEMBL_1465155 (CHEMBL3405856)
Ki 490±n/a nM
Citation Wan, YWu, SXiao, GLiu, THou, XChen, CGuan, PYang, XFang, H Design, synthesis and preliminary bioactivity studies of 2-thioxo-4-thiazolidinone derivatives as Bcl-2 inhibitors. Bioorg Med Chem23:1994-2003 (2015) 
 
Apoptosis regulator Bcl-2
Name:Apoptosis regulator Bcl-2
Type:Homodimer or heterodimer
Mol. Mass.:26269.11
Organism:Homo sapiens (Human)
Description:P10415
Residue:239
BDBM50067364
NameBDBM50067364
Synonyms:CHEMBL3401816
TypeSmall organic molecule
Emp. Form.C31H21BrClN3O6S3
Mol. Mass.743.067
SMILES[O-][N+](=O)c1ccc(cc1)S(=O)(=O)NC(=O)[C@H](Cc1ccc(Br)cc1)N1C(=S)S\C(=C/c2ccc(cc2)-c2ccc(Cl)cc2)C1=O