Reaction Details
TargetcAMP-dependent protein kinase catalytic subunit alpha
LigandBDBM50067533
Substrate/Competitorn/a
Meas. Tech.ChEMBL_1465695 (CHEMBL3405456)
Ki 230±n/a nM
Citation Boyd, MJBandarage, UKBennett, HByrn, RRDavies, IGu, WJacobs, MLedeboer, MWLedford, BLeeman, JRPerola, EWang, TBennani, YClark, MPCharifson, PS Isosteric replacements of the carboxylic acid of drug candidate VX-787: Effect of charge on antiviral potency and kinase activity of azaindole-based influenza PB2 inhibitors. Bioorg Med Chem Lett25:1990-4 (2015) 
 
cAMP-dependent protein kinase catalytic subunit alpha
Name:cAMP-dependent protein kinase catalytic subunit alpha
Type:Enzyme Catalytic Subunit
Mol. Mass.:40598.73
Organism:Homo sapiens (Human)
Description:n/a
Residue:351
BDBM50067533
NameBDBM50067533
Synonyms:CHEMBL3401984
TypeSmall organic molecule
Emp. Form.C21H23F2N5O2
Mol. Mass.415.4364
SMILES[H][C@]1(C(O)CO)C2CCC(CC2)[C@@H]1Nc1nc(ncc1F)-c1c[nH]c2ncc(F)cc12