Reaction Details
TargetPhosphatidylinositol 4,5-bisphosphate 3-kinase catalytic subunit gamma isoform
LigandBDBM50067540
Substrate/Competitorn/a
Meas. Tech.ChEMBL_1465821 (CHEMBL3406126)
Ki 1200±n/a nM
Citation Boyd, MJBandarage, UKBennett, HByrn, RRDavies, IGu, WJacobs, MLedeboer, MWLedford, BLeeman, JRPerola, EWang, TBennani, YClark, MPCharifson, PS Isosteric replacements of the carboxylic acid of drug candidate VX-787: Effect of charge on antiviral potency and kinase activity of azaindole-based influenza PB2 inhibitors. Bioorg Med Chem Lett25:1990-4 (2015) 
 
Phosphatidylinositol 4,5-bisphosphate 3-kinase catalytic subunit gamma isoform
Name:Phosphatidylinositol 4,5-bisphosphate 3-kinase catalytic subunit gamma isoform
Type:Enzyme Subunit
Mol. Mass.:126470.30
Organism:Homo sapiens (Human)
Description:P48736
Residue:1102
BDBM50067540
NameBDBM50067540
Synonyms:CHEMBL3401990
TypeSmall organic molecule
Emp. Form.C20H21F2N5O2S
Mol. Mass.433.475
SMILESCS(=O)(=O)[C@H]1C2CCC(CC2)[C@@H]1Nc1nc(ncc1F)-c1c[nH]c2ncc(F)cc12