Reaction Details
TargetHepatocyte growth factor receptor
LigandBDBM50067537
Substrate/Competitorn/a
Meas. Tech.ChEMBL_1465700 (CHEMBL3405461)
Ki>4000±n/a nM
Citation Boyd, MJBandarage, UKBennett, HByrn, RRDavies, IGu, WJacobs, MLedeboer, MWLedford, BLeeman, JRPerola, EWang, TBennani, YClark, MPCharifson, PS Isosteric replacements of the carboxylic acid of drug candidate VX-787: Effect of charge on antiviral potency and kinase activity of azaindole-based influenza PB2 inhibitors. Bioorg Med Chem Lett25:1990-4 (2015) 
 
Hepatocyte growth factor receptor
Name:Hepatocyte growth factor receptor
Type:Protein
Mol. Mass.:155559.73
Organism:Homo sapiens (Human)
Description:P08581
Residue:1390
BDBM50067537
NameBDBM50067537
Synonyms:CHEMBL3401987
TypeSmall organic molecule
Emp. Form.C21H23F2N5O
Mol. Mass.399.437
SMILES[H][C@]1(C(C)O)C2CCC(CC2)[C@@H]1Nc1nc(ncc1F)-c1c[nH]c2ncc(F)cc12