Reaction Details
TargetInterleukin-1 receptor-associated kinase 4
LigandBDBM50067541
Substrate/Competitorn/a
Meas. Tech.ChEMBL_1465696 (CHEMBL3405457)
Ki>4000±n/a nM
Citation Boyd, MJBandarage, UKBennett, HByrn, RRDavies, IGu, WJacobs, MLedeboer, MWLedford, BLeeman, JRPerola, EWang, TBennani, YClark, MPCharifson, PS Isosteric replacements of the carboxylic acid of drug candidate VX-787: Effect of charge on antiviral potency and kinase activity of azaindole-based influenza PB2 inhibitors. Bioorg Med Chem Lett25:1990-4 (2015) 
 
Interleukin-1 receptor-associated kinase 4
Name:Interleukin-1 receptor-associated kinase 4
Type:Protein
Mol. Mass.:51519.08
Organism:Homo sapiens (Human)
Description:Q9NWZ3
Residue:460
BDBM50067541
NameBDBM50067541
Synonyms:CHEMBL3401975
TypeSmall organic molecule
Emp. Form.C20H19F2N9
Mol. Mass.423.422
SMILESFc1cnc2[nH]cc(-c3ncc(F)c(N[C@H]4C5CCC(CC5)[C@@H]4c4nnn[nH]4)n3)c2c1