Reaction Details
TargetVascular endothelial growth factor receptor 2
LigandBDBM50067531
Substrate/Competitorn/a
Meas. Tech.ChEMBL_1465693 (CHEMBL3405454)
Ki 1900±n/a nM
Citation Boyd, MJBandarage, UKBennett, HByrn, RRDavies, IGu, WJacobs, MLedeboer, MWLedford, BLeeman, JRPerola, EWang, TBennani, YClark, MPCharifson, PS Isosteric replacements of the carboxylic acid of drug candidate VX-787: Effect of charge on antiviral potency and kinase activity of azaindole-based influenza PB2 inhibitors. Bioorg Med Chem Lett25:1990-4 (2015) 
 
Vascular endothelial growth factor receptor 2
Name:Vascular endothelial growth factor receptor 2
Type:Receptor Tyrosine Kinase
Mol. Mass.:151510.97
Organism:Homo sapiens (Human)
Description:P35968
Residue:1356
BDBM50067531
NameBDBM50067531
Synonyms:CHEMBL3401983
TypeSmall organic molecule
Emp. Form.C19H20F2N6O2S
Mol. Mass.434.463
SMILESNS(=O)(=O)[C@H]1C2CCC(CC2)[C@@H]1Nc1nc(ncc1F)-c1c[nH]c2ncc(F)cc12