Reaction Details
TargetCarbonic anhydrase 2
LigandBDBM50067987
Substrate/Competitorn/a
Meas. Tech.ChEMBL_1466432 (CHEMBL3406377)
Ki 13±n/a nM
Citation Bozdag, MCarta, FVullo, DAkdemir, AIsik, SLanzi, CScozzafava, AMasini, ESupuran, CT Synthesis of a new series of dithiocarbamates with effective human carbonic anhydrase inhibitory activity and antiglaucoma action. Bioorg Med Chem23:2368-76 (2015) 
 
Carbonic anhydrase 2
Name:Carbonic anhydrase 2
Type:Enzyme
Mol. Mass.:29250.71
Organism:Homo sapiens (Human)
Description:P00918
Residue:260
BDBM50067987
NameBDBM50067987
Synonyms:CHEMBL3400811
TypeSmall organic molecule
Emp. Form.C11H19KN2OS2
Mol. Mass.298.51
SMILES[K+].CC(C)(C)C(=O)NC1CCCN(C1)C([S-])=S