Reaction Details
TargetCarbonic anhydrase 1
LigandBDBM50067990
Substrate/Competitorn/a
Meas. Tech.ChEMBL_1466431 (CHEMBL3406376)
Ki 415±n/a nM
Citation Bozdag, MCarta, FVullo, DAkdemir, AIsik, SLanzi, CScozzafava, AMasini, ESupuran, CT Synthesis of a new series of dithiocarbamates with effective human carbonic anhydrase inhibitory activity and antiglaucoma action. Bioorg Med Chem23:2368-76 (2015) 
 
Carbonic anhydrase 1
Name:Carbonic anhydrase 1
Type:Enzyme
Mol. Mass.:28873.37
Organism:Homo sapiens (Human)
Description:P00915
Residue:261
BDBM50067990
NameBDBM50067990
Synonyms:CHEMBL3400814
TypeSmall organic molecule
Emp. Form.C13H22N3NaOS2
Mol. Mass.323.453
SMILES[Na+].[S-]C(=S)N1CCN(CC(=O)NC2CCCCC2)CC1