Reaction Details
TargetCarbonic anhydrase 1
LigandBDBM50067986
Substrate/Competitorn/a
Meas. Tech.ChEMBL_1466431 (CHEMBL3406376)
Ki 910±n/a nM
Citation Bozdag, MCarta, FVullo, DAkdemir, AIsik, SLanzi, CScozzafava, AMasini, ESupuran, CT Synthesis of a new series of dithiocarbamates with effective human carbonic anhydrase inhibitory activity and antiglaucoma action. Bioorg Med Chem23:2368-76 (2015) 
 
Carbonic anhydrase 1
Name:Carbonic anhydrase 1
Type:Enzyme
Mol. Mass.:28873.37
Organism:Homo sapiens (Human)
Description:P00915
Residue:261
BDBM50067986
NameBDBM50067986
Synonyms:CHEMBL3400810
TypeSmall organic molecule
Emp. Form.C8H13KN2OS2
Mol. Mass.256.43
SMILES[K+].CC(=O)NC1CCCN(C1)C([S-])=S