Reaction Details
TargetCarbonic anhydrase 1
LigandBDBM50067982
Substrate/Competitorn/a
Meas. Tech.ChEMBL_1466431 (CHEMBL3406376)
Ki 290±n/a nM
Citation Bozdag, MCarta, FVullo, DAkdemir, AIsik, SLanzi, CScozzafava, AMasini, ESupuran, CT Synthesis of a new series of dithiocarbamates with effective human carbonic anhydrase inhibitory activity and antiglaucoma action. Bioorg Med Chem23:2368-76 (2015) 
 
Carbonic anhydrase 1
Name:Carbonic anhydrase 1
Type:Enzyme
Mol. Mass.:28873.37
Organism:Homo sapiens (Human)
Description:P00915
Residue:261
BDBM50067982
NameBDBM50067982
Synonyms:CHEMBL3400806
TypeSmall organic molecule
Emp. Form.C7H9NNa2O2S2
Mol. Mass.249.261
SMILES[Na+].[Na+].[O-]C(=O)C1CCCN(C1)C([S-])=S