Reaction Details
TargetCarbonic anhydrase 1
LigandBDBM50067999
Substrate/Competitorn/a
Meas. Tech.ChEMBL_1466431 (CHEMBL3406376)
Ki 615±n/a nM
Citation Bozdag, MCarta, FVullo, DAkdemir, AIsik, SLanzi, CScozzafava, AMasini, ESupuran, CT Synthesis of a new series of dithiocarbamates with effective human carbonic anhydrase inhibitory activity and antiglaucoma action. Bioorg Med Chem23:2368-76 (2015) 
 
Carbonic anhydrase 1
Name:Carbonic anhydrase 1
Type:Enzyme
Mol. Mass.:28873.37
Organism:Homo sapiens (Human)
Description:P00915
Residue:261
BDBM50067999
NameBDBM50067999
Synonyms:CHEMBL3400803
TypeSmall organic molecule
Emp. Form.C8H13N2NaS2
Mol. Mass.224.322
SMILES[Na+].[S-]C(=S)N[C@@H]1CN2CCC1CC2