Reaction Details
TargetCarbonic anhydrase 1
LigandBDBM50067993
Substrate/Competitorn/a
Meas. Tech.ChEMBL_1466431 (CHEMBL3406376)
Ki 86±n/a nM
Citation Bozdag, MCarta, FVullo, DAkdemir, AIsik, SLanzi, CScozzafava, AMasini, ESupuran, CT Synthesis of a new series of dithiocarbamates with effective human carbonic anhydrase inhibitory activity and antiglaucoma action. Bioorg Med Chem23:2368-76 (2015) 
 
Carbonic anhydrase 1
Name:Carbonic anhydrase 1
Type:Enzyme
Mol. Mass.:28873.37
Organism:Homo sapiens (Human)
Description:P00915
Residue:261
BDBM50067993
NameBDBM50067993
Synonyms:CHEMBL3400797
TypeSmall organic molecule
Emp. Form.C5H11KN2S2
Mol. Mass.202.383
SMILES[K+].CN(C)CCNC([S-])=S