Reaction Details
TargetCarbonic anhydrase 1
LigandBDBM50068115
Substrate/Competitorn/a
Meas. Tech.ChEMBL_1464058 (CHEMBL3406243)
Ki 36±n/a nM
Citation Yildirim, AAtmaca, UKeskin, ATopal, MÇelik, MGülçin, ISupuran, CT N-Acylsulfonamides strongly inhibit human carbonic anhydrase isoenzymes I and II. Bioorg Med Chem23:2598-605 (2015) 
 
Carbonic anhydrase 1
Name:Carbonic anhydrase 1
Type:Enzyme
Mol. Mass.:28873.37
Organism:Homo sapiens (Human)
Description:P00915
Residue:261
BDBM50068115
NameBDBM50068115
Synonyms:CHEMBL3402248
TypeSmall organic molecule
Emp. Form.C23H17Cl6NO5S
Mol. Mass.632.168
SMILESCc1ccc(cc1)S(=O)(=O)NC(=O)C1[C@H](C(=O)OCc2ccccc2)[C@@]2(Cl)C(Cl)=C(Cl)[C@@]1(Cl)C2(Cl)Cl