Reaction Details
TargetInterleukin-5
LigandBDBM50068124
Substrate/Competitorn/a
Meas. Tech.ChEMBL_1464308 (CHEMBL3404575)
IC50 16000±n/a nM
Citation Venkateswararao, EManickam, MBoggu, PKim, YJung, SH Exploration of benzamidochromenone derivatives with conformational restrictor as interleukin-5 inhibitors. Bioorg Med Chem23:2498-504 (2015) 
 
Interleukin-5
Name:Interleukin-5
Type:PROTEIN
Mol. Mass.:15414.97
Organism:Mus musculus
Description:ChEMBL_1464308
Residue:133
BDBM50068124
NameBDBM50068124
Synonyms:CHEMBL3402261
TypeSmall organic molecule
Emp. Form.C25H19NO5
Mol. Mass.413.4221
SMILESCC(=O)OCc1c(oc2ccc(NC(=O)c3ccccc3)cc2c1=O)-c1ccccc1