Reaction Details
TargetInterleukin-5
LigandBDBM50424123
Substrate/Competitorn/a
Meas. Tech.ChEMBL_1464308 (CHEMBL3404575)
IC50 12600±n/a nM
Citation Venkateswararao, EManickam, MBoggu, PKim, YJung, SH Exploration of benzamidochromenone derivatives with conformational restrictor as interleukin-5 inhibitors. Bioorg Med Chem23:2498-504 (2015) 
 
Interleukin-5
Name:Interleukin-5
Type:PROTEIN
Mol. Mass.:15414.97
Organism:Mus musculus
Description:ChEMBL_1464308
Residue:133
BDBM50424123
NameBDBM50424123
Synonyms:CHEMBL2316358
TypeSmall organic molecule
Emp. Form.C22H24O4
Mol. Mass.352.4236
SMILESOc1ccc(cc1)C(=O)\C=C\c1c(O)cccc1OCC1CCCCC1