Reaction Details
TargetAlkaline phosphatase, tissue-nonspecific isozyme
LigandBDBM50068227
Substrate/Competitorn/a
Meas. Tech.ChEMBL_1464323 (CHEMBL3404590)
IC50 2240±n/a nM
Citation Al-Rashida, MEjaz, SAAli, SShaukat, AHamayoun, MAhmed, MIqbal, J Diarylsulfonamides and their bioisosteres as dual inhibitors of alkaline phosphatase and carbonic anhydrase: Structure activity relationship and molecular modelling studies. Bioorg Med Chem23:2435-44 (2015) 
 
Alkaline phosphatase, tissue-nonspecific isozyme
Name:Alkaline phosphatase, tissue-nonspecific isozyme
Type:Protein
Mol. Mass.:57195.60
Organism:Bos taurus (Cattle)
Description:P09487
Residue:524
BDBM50068227
NameBDBM50068227
Synonyms:CHEMBL3403325
TypeSmall organic molecule
Emp. Form.C13H14N2O4S2
Mol. Mass.326.391
SMILESCc1ccc(cc1)S(=O)(=O)Nc1cccc(c1)S(N)(=O)=O