Reaction Details
TargetAlkaline phosphatase, tissue-nonspecific isozyme
LigandBDBM50247721
Substrate/Competitorn/a
Meas. Tech.ChEMBL_1464323 (CHEMBL3404590)
IC50 2940±n/a nM
Citation Al-Rashida, MEjaz, SAAli, SShaukat, AHamayoun, MAhmed, MIqbal, J Diarylsulfonamides and their bioisosteres as dual inhibitors of alkaline phosphatase and carbonic anhydrase: Structure activity relationship and molecular modelling studies. Bioorg Med Chem23:2435-44 (2015) 
 
Alkaline phosphatase, tissue-nonspecific isozyme
Name:Alkaline phosphatase, tissue-nonspecific isozyme
Type:Protein
Mol. Mass.:57195.60
Organism:Bos taurus (Cattle)
Description:P09487
Residue:524
BDBM50247721
NameBDBM50247721
Synonyms:4-fluoro-N-(4-sulfamoylbenzyl)benzenesulfonamide | CHEMBL511186
TypeSmall organic molecule
Emp. Form.C13H13FN2O4S2
Mol. Mass.344.382
SMILESNS(=O)(=O)c1ccc(CNS(=O)(=O)c2ccc(F)cc2)cc1