Reaction Details
TargetCarbonic anhydrase 2
LigandBDBM50068221
Substrate/Competitorn/a
Meas. Tech.ChEMBL_1464326 (CHEMBL3404593)
IC50 656±n/a nM
Citation Al-Rashida, MEjaz, SAAli, SShaukat, AHamayoun, MAhmed, MIqbal, J Diarylsulfonamides and their bioisosteres as dual inhibitors of alkaline phosphatase and carbonic anhydrase: Structure activity relationship and molecular modelling studies. Bioorg Med Chem23:2435-44 (2015) 
 
Carbonic anhydrase 2
Name:Carbonic anhydrase 2
Type:Enzyme Catalytic Domain
Mol. Mass.:29115.93
Organism:Bos taurus
Description:n/a
Residue:260
BDBM50068221
NameBDBM50068221
Synonyms:CHEMBL3403321
TypeSmall organic molecule
Emp. Form.C15H15FN2O3S
Mol. Mass.322.355
SMILESNS(=O)(=O)c1ccc(CCNC(=O)c2ccc(F)cc2)cc1