Reaction Details
TargetCarbonic anhydrase 2
LigandBDBM50068225
Substrate/Competitorn/a
Meas. Tech.ChEMBL_1464326 (CHEMBL3404593)
IC50 134±n/a nM
Citation Al-Rashida, MEjaz, SAAli, SShaukat, AHamayoun, MAhmed, MIqbal, J Diarylsulfonamides and their bioisosteres as dual inhibitors of alkaline phosphatase and carbonic anhydrase: Structure activity relationship and molecular modelling studies. Bioorg Med Chem23:2435-44 (2015) 
 
Carbonic anhydrase 2
Name:Carbonic anhydrase 2
Type:Enzyme Catalytic Domain
Mol. Mass.:29115.93
Organism:Bos taurus
Description:n/a
Residue:260
BDBM50068225
NameBDBM50068225
Synonyms:CHEMBL3403324
TypeSmall organic molecule
Emp. Form.C14H16N2O4S2
Mol. Mass.340.418
SMILESCc1ccc(cc1)S(=O)(=O)NCc1ccc(cc1)S(N)(=O)=O